Project

General

Profile

consoleText.txt

cdywan, 2020-12-29 10:44

 
1
Started by upstream project "trigger-openQA_in_openQA-TW" build number 6848
2
originally caused by:
3
 [URLTrigger] A change within the response URL invocation (log)
4
Running as SYSTEM
5
Building in workspace /var/lib/jenkins/workspace/monitor-openQA_in_openQA-TW
6
Copied 1 artifact from "trigger-openQA_in_openQA-TW" build number 6848
7
[monitor-openQA_in_openQA-TW] $ /bin/sh -xe /tmp/jenkins4087999913160376779.sh
8
+ env obs_component=project openqa_groupid=24 monitor-openqa_job devel:openQA
9
+ sleep_time=10
10
+ openqa_client=/usr/share/openqa/script/client
11
+ host=https://openqa.opensuse.org
12
+ openqa_groupid=24
13
+ obs_component=project
14
++ dirname /opt/openqa-scripts/monitor-openqa_job
15
+ . /opt/openqa-scripts/_common
16
+ '[' -f job_post_response ']'
17
++ filter_id job_post_response
18
++ sed -n 's/^.*ids\?\s*=>\s*\[\?\([0-9]\+\)\]\?.*$/\1/p' job_post_response
19
+ JOB_ID='1533864
20
200817'
21
+ echo 'waiting for job 1533864
22
200817 to finish'
23
waiting for job 1533864
24
200817 to finish
25
+ sleep 10
26
+ /usr/share/openqa/script/client --host https://openqa.opensuse.org jobs/1533864 200817
27
+ grep -q 'state.*done'
28
+ break
29
++ /usr/share/openqa/script/client --host https://openqa.opensuse.org jobs/1533864 200817
30
+ response='{
31
  job => {
32
           assigned_worker_id => 190,
33
           blocked_by_id      => undef,
34
           children           => { "Chained" => [], "Directly chained" => [], "Parallel" => [] },
35
           clone_id           => undef,
36
           group              => "openQA",
37
           group_id           => 24,
38
           has_parents        => 0,
39
           id                 => 1533864,
40
           name               => "openqa-Tumbleweed-dev-x86_64-Build:TW.6848-openqa_install+publish\@64bit-2G",
41
           parents            => { "Chained" => [], "Directly chained" => [], "Parallel" => [] },
42
           parents_ok         => 1,
43
           priority           => 50,
44
           reason             => "asset failure: Failed to download null to /var/lib/openqa/cache/openqa1-opensuse/null",
45
           result             => "incomplete",
46
           settings           => {
47
                                   ARCH                => "x86_64",
48
                                   BACKEND             => "qemu",
49
                                   BUILD               => ":TW.6848",
50
                                   DISTRI              => "openqa",
51
                                   FLAVOR              => "dev",
52
                                   HDD_1               => "null",
53
                                   HDDSIZEGB           => 20,
54
                                   INSTALL             => 1,
55
                                   INSTALL_ONLY        => 1,
56
                                   JOB_DESCRIPTION     => "Maintainer: okurz\@suse.de Test for installation of openQA itself. To be used with \"openqa\" distri. Publishes an qcow2 image including the openQA installation ready to run as an appliance.",
57
                                   MACHINE             => "64bit-2G",
58
                                   NAME                => "01533864-openqa-Tumbleweed-dev-x86_64-Build:TW.6848-openqa_install+publish\@64bit-2G",
59
                                   OPENQA_HOST         => "http://openqa.opensuse.org",
60
                                   PUBLISH_HDD_1       => "opensuse-Tumbleweed-x86_64\@64bit-2G-:TW.6848.qcow2",
61
                                   PUBLISH_PFLASH_VARS => "opensuse-Tumbleweed-x86_64\@64bit-2G-:TW.6848-uefi-vars.qcow2",
62
                                   QEMUCPU             => "host",
63
                                   QEMURAM             => 2048,
64
                                   TEST                => "openqa_install+publish",
65
                                   TEST_SUITE_NAME     => "-",
66
                                   UPDATE              => 0,
67
                                   VERSION             => "Tumbleweed",
68
                                   WORKER_CLASS        => "qemu_x86_64",
69
                                 },
70
           state              => "done",
71
           t_finished         => "2020-12-29T09:24:14",
72
           t_started          => "2020-12-29T09:24:09",
73
           test               => "openqa_install+publish",
74
         },
75
}'
76
++ echo '{
77
  job => {
78
           assigned_worker_id => 190,
79
           blocked_by_id      => undef,
80
           children           => { "Chained" => [], "Directly chained" => [], "Parallel" => [] },
81
           clone_id           => undef,
82
           group              => "openQA",
83
           group_id           => 24,
84
           has_parents        => 0,
85
           id                 => 1533864,
86
           name               => "openqa-Tumbleweed-dev-x86_64-Build:TW.6848-openqa_install+publish\@64bit-2G",
87
           parents            => { "Chained" => [], "Directly chained" => [], "Parallel" => [] },
88
           parents_ok         => 1,
89
           priority           => 50,
90
           reason             => "asset failure: Failed to download null to /var/lib/openqa/cache/openqa1-opensuse/null",
91
           result             => "incomplete",
92
           settings           => {
93
                                   ARCH                => "x86_64",
94
                                   BACKEND             => "qemu",
95
                                   BUILD               => ":TW.6848",
96
                                   DISTRI              => "openqa",
97
                                   FLAVOR              => "dev",
98
                                   HDD_1               => "null",
99
                                   HDDSIZEGB           => 20,
100
                                   INSTALL             => 1,
101
                                   INSTALL_ONLY        => 1,
102
                                   JOB_DESCRIPTION     => "Maintainer: okurz\@suse.de Test for installation of openQA itself. To be used with \"openqa\" distri. Publishes an qcow2 image including the openQA installation ready to run as an appliance.",
103
                                   MACHINE             => "64bit-2G",
104
                                   NAME                => "01533864-openqa-Tumbleweed-dev-x86_64-Build:TW.6848-openqa_install+publish\@64bit-2G",
105
                                   OPENQA_HOST         => "http://openqa.opensuse.org",
106
                                   PUBLISH_HDD_1       => "opensuse-Tumbleweed-x86_64\@64bit-2G-:TW.6848.qcow2",
107
                                   PUBLISH_PFLASH_VARS => "opensuse-Tumbleweed-x86_64\@64bit-2G-:TW.6848-uefi-vars.qcow2",
108
                                   QEMUCPU             => "host",
109
                                   QEMURAM             => 2048,
110
                                   TEST                => "openqa_install+publish",
111
                                   TEST_SUITE_NAME     => "-",
112
                                   UPDATE              => 0,
113
                                   VERSION             => "Tumbleweed",
114
                                   WORKER_CLASS        => "qemu_x86_64",
115
                                 },
116
           state              => "done",
117
           t_finished         => "2020-12-29T09:24:14",
118
           t_started          => "2020-12-29T09:24:09",
119
           test               => "openqa_install+publish",
120
         },
121
}'
122
++ sed -n 's/^.*result\s*=> "\([^"]*\)",.*/\1/p'
123
+ result=incomplete
124
+ echo 'job result: incomplete'
125
job result: incomplete
126
+ obs_package_name=devel:openQA
127
+ echo incomplete
128
+ grep -q passed
129
+ '[' -n devel:openQA ']'
130
++ /usr/share/openqa/script/client --host https://openqa.opensuse.org jobs/1533864 200817
131
++ sed -n 's/^.*VERSION\s*=> "\([^"]*\)",.*/\1/p'
132
+ VERSION=Tumbleweed
133
+ osc api /comments/project/devel:openQA
134
+ sed -n 's/.*id="\([^"]*\)">test failed.*/\1/p'
135
+ read -r id
136
+ grep id=
137
Error initializing plugin Google = keyrings.alt.Google.
138
Traceback (most recent call last):
139
  File "/usr/lib/python3.6/site-packages/keyring/backend.py", line 171, in _load_plugins
140
    init_func = ep.load()
141
  File "/usr/lib/python3.6/site-packages/pkg_resources/__init__.py", line 2343, in load
142
    return self.resolve()
143
  File "/usr/lib/python3.6/site-packages/pkg_resources/__init__.py", line 2349, in resolve
144
    module = __import__(self.module_name, fromlist=['__name__'], level=0)
145
  File "/usr/lib/python3.6/site-packages/keyrings/alt/Google.py", line 14, in <module>
146
    import gdata.docs.service
147
  File "/usr/lib/python3.6/site-packages/gdata/__init__.py", line 27, in <module>
148
    import atom
149
  File "/usr/lib/python3.6/site-packages/atom/__init__.py", line 133, in <module>
150
    CreateClassFromXMLString)
151
  File "/usr/lib/python3.6/site-packages/atom/__init__.py", line 97, in mark_deprecated
152
    optional_warn_function.func_name = f.func_name
153
AttributeError: 'function' object has no attribute 'func_name'
154
+ osc api -X DELETE /comment/1382814
155
Error initializing plugin Google = keyrings.alt.Google.
156
Traceback (most recent call last):
157
  File "/usr/lib/python3.6/site-packages/keyring/backend.py", line 171, in _load_plugins
158
    init_func = ep.load()
159
  File "/usr/lib/python3.6/site-packages/pkg_resources/__init__.py", line 2343, in load
160
    return self.resolve()
161
  File "/usr/lib/python3.6/site-packages/pkg_resources/__init__.py", line 2349, in resolve
162
    module = __import__(self.module_name, fromlist=['__name__'], level=0)
163
  File "/usr/lib/python3.6/site-packages/keyrings/alt/Google.py", line 14, in <module>
164
    import gdata.docs.service
165
  File "/usr/lib/python3.6/site-packages/gdata/__init__.py", line 27, in <module>
166
    import atom
167
  File "/usr/lib/python3.6/site-packages/atom/__init__.py", line 133, in <module>
168
    CreateClassFromXMLString)
169
  File "/usr/lib/python3.6/site-packages/atom/__init__.py", line 97, in mark_deprecated
170
    optional_warn_function.func_name = f.func_name
171
AttributeError: 'function' object has no attribute 'func_name'
172
<status code="ok">
173
  <summary>Ok</summary>
174
</status>
175
+ read -r id
176
+ osc api '--data=test failed, see https://openqa.opensuse.org/tests/overview?version=Tumbleweed&groupid=24' -X POST /comments/project/devel:openQA
177
Error initializing plugin Google = keyrings.alt.Google.
178
Traceback (most recent call last):
179
  File "/usr/lib/python3.6/site-packages/keyring/backend.py", line 171, in _load_plugins
180
    init_func = ep.load()
181
  File "/usr/lib/python3.6/site-packages/pkg_resources/__init__.py", line 2343, in load
182
    return self.resolve()
183
  File "/usr/lib/python3.6/site-packages/pkg_resources/__init__.py", line 2349, in resolve
184
    module = __import__(self.module_name, fromlist=['__name__'], level=0)
185
  File "/usr/lib/python3.6/site-packages/keyrings/alt/Google.py", line 14, in <module>
186
    import gdata.docs.service
187
  File "/usr/lib/python3.6/site-packages/gdata/__init__.py", line 27, in <module>
188
    import atom
189
  File "/usr/lib/python3.6/site-packages/atom/__init__.py", line 133, in <module>
190
    CreateClassFromXMLString)
191
  File "/usr/lib/python3.6/site-packages/atom/__init__.py", line 97, in mark_deprecated
192
    optional_warn_function.func_name = f.func_name
193
AttributeError: 'function' object has no attribute 'func_name'
194
<status code="ok">
195
  <summary>Ok</summary>
196
</status>
197
+ exit 1
198
Build step 'Execute shell' marked build as failure
199
Archiving artifacts
200
Started calculate disk usage of build
201
Finished Calculation of disk usage of build in 0 seconds
202
Started calculate disk usage of workspace
203
Finished Calculation of disk usage of workspace in 0 seconds
204
Notifying upstream projects of job completion
205
IRC notifier plugin: Sending notification to: #openqa-test
206
IRC notifier plugin: Notifying suspects
207
IRC notifier plugin: Notifying culprits
208
Finished: FAILURE